BDBM448355 Perampanel, 10
SMILES COc1cc(Cl)cc(c1)C1C=C(C(=O)N(C1=O)c1cccnc1)c1c[nH]c(=O)[nH]c1=O
InChI Key
Data  1 IC50
  Tab Delimited (TSV)   2D SDfile   Computed 3D by Vconf -m prep SDfile
Find this compound or compounds like it in BindingDB:
Activity Spreadsheet -- Enzyme Inhibition Constant Data from BindingDB
Found 1 hit for monomerid = 448355
TargetReplicase polyprotein 1ab(2019-nCoV)
Yale University
LigandPNGBDBM448355(Perampanel, 10)
Affinity DataIC50:  1.20E+3nM. Assay description: Inhibition of proteolytic activity was tested using recombinant SARS-CoV-2Mpro, which was expressed and purified as previously described.8,12 For the...
Ligand InfoPC cidPC sid
In DepthDetails Article